Question kapt Build échoue avec le processeur Android Dagger


J'essaie d'inclure le processeur Dagger Android (documenté ici) dans mon projet avec le Outil de traitement des annotations Kotlin (kapt).

J'ai inclus les dépendances appropriées dans mon build.gradle fichier:

apply plugin: 'com.android.application'
apply plugin: 'kotlin-android'
apply plugin: 'kotlin-kapt'

android {
    compileSdkVersion 25
    buildToolsVersion "25.0.2"
    defaultConfig {
        applicationId "com.example.app"
        minSdkVersion 16
        targetSdkVersion 25
        versionCode 1
        versionName "1.0"
        testInstrumentationRunner "android.support.test.runner.AndroidJUnitRunner"
    }
    sourceSets {
        main.java.srcDirs += 'src/main/kotlin'
    }
    buildTypes {
        release {
            minifyEnabled false
            proguardFiles getDefaultProguardFile('proguard-android.txt'), 'proguard-rules.pro'
        }
    }
}

dependencies {
    compile fileTree(dir: 'libs', include: ['*.jar'])
    androidTestCompile('com.android.support.test.espresso:espresso-core:2.2.2', {
        exclude group: 'com.android.support', module: 'support-annotations'
        exclude group: 'com.google.code.findbugs', module: 'jsr305'
    })

    // Support libraries
    compile "com.android.support:appcompat-v7:25.3.1"
    compile "com.android.support:design:25.3.1"
    compile "com.android.support.constraint:constraint-layout:1.0.2"

    // Google libraries
    compile "com.google.dagger:dagger-android:2.10"
    compile "com.google.dagger:dagger-android-support:2.10"
    kapt "com.google.dagger:dagger-android-processor:2.10"

    // ReactiveX libraries
    compile "io.reactivex.rxjava2:rxandroid:2.0.1"
    compile "io.reactivex.rxjava2:rxjava:2.0.9"

    // Kotlin libraries
    compile "org.jetbrains.kotlin:kotlin-stdlib-jre7:1.1.2"

    // Test instrumentation
    testCompile "junit:junit:4.12"
}

Mais quand je construis le projet, je reçois ce qui suit GradleException:

:app:kaptDebugKotlin FAILED

FAILURE: Build failed with an exception.

* What went wrong:
Execution failed for task ':app:kaptDebugKotlin'.
> Internal compiler error. See log for more details

* Try:
Run with --info or --debug option to get more log output.

* Exception is:
org.gradle.api.tasks.TaskExecutionException: Execution failed for task ':app:kaptDebugKotlin'.
    at org.gradle.api.internal.tasks.execution.ExecuteActionsTaskExecuter.executeActions(ExecuteActionsTaskExecuter.java:84)
    at org.gradle.api.internal.tasks.execution.ExecuteActionsTaskExecuter.execute(ExecuteActionsTaskExecuter.java:55)
    at org.gradle.api.internal.tasks.execution.SkipUpToDateTaskExecuter.execute(SkipUpToDateTaskExecuter.java:62)
    at org.gradle.api.internal.tasks.execution.ValidatingTaskExecuter.execute(ValidatingTaskExecuter.java:58)
    at org.gradle.api.internal.tasks.execution.SkipEmptySourceFilesTaskExecuter.execute(SkipEmptySourceFilesTaskExecuter.java:88)
    at org.gradle.api.internal.tasks.execution.ResolveTaskArtifactStateTaskExecuter.execute(ResolveTaskArtifactStateTaskExecuter.java:46)
    at org.gradle.api.internal.tasks.execution.SkipTaskWithNoActionsExecuter.execute(SkipTaskWithNoActionsExecuter.java:51)
    at org.gradle.api.internal.tasks.execution.SkipOnlyIfTaskExecuter.execute(SkipOnlyIfTaskExecuter.java:54)
    at org.gradle.api.internal.tasks.execution.ExecuteAtMostOnceTaskExecuter.execute(ExecuteAtMostOnceTaskExecuter.java:43)
    at org.gradle.api.internal.tasks.execution.CatchExceptionTaskExecuter.execute(CatchExceptionTaskExecuter.java:34)
    at org.gradle.execution.taskgraph.DefaultTaskGraphExecuter$EventFiringTaskWorker$1.execute(DefaultTaskGraphExecuter.java:236)
    at org.gradle.execution.taskgraph.DefaultTaskGraphExecuter$EventFiringTaskWorker$1.execute(DefaultTaskGraphExecuter.java:228)
    at org.gradle.internal.Transformers$4.transform(Transformers.java:169)
    at org.gradle.internal.progress.DefaultBuildOperationExecutor.run(DefaultBuildOperationExecutor.java:106)
    at org.gradle.internal.progress.DefaultBuildOperationExecutor.run(DefaultBuildOperationExecutor.java:61)
    at org.gradle.execution.taskgraph.DefaultTaskGraphExecuter$EventFiringTaskWorker.execute(DefaultTaskGraphExecuter.java:228)
    at org.gradle.execution.taskgraph.DefaultTaskGraphExecuter$EventFiringTaskWorker.execute(DefaultTaskGraphExecuter.java:215)
    at org.gradle.execution.taskgraph.AbstractTaskPlanExecutor$TaskExecutorWorker.processTask(AbstractTaskPlanExecutor.java:77)
    at org.gradle.execution.taskgraph.AbstractTaskPlanExecutor$TaskExecutorWorker.run(AbstractTaskPlanExecutor.java:58)
    at org.gradle.execution.taskgraph.DefaultTaskPlanExecutor.process(DefaultTaskPlanExecutor.java:32)
    at org.gradle.execution.taskgraph.DefaultTaskGraphExecuter.execute(DefaultTaskGraphExecuter.java:113)
    at org.gradle.execution.SelectedTaskExecutionAction.execute(SelectedTaskExecutionAction.java:37)
    at org.gradle.execution.DefaultBuildExecuter.execute(DefaultBuildExecuter.java:37)
    at org.gradle.execution.DefaultBuildExecuter.access$000(DefaultBuildExecuter.java:23)
    at org.gradle.execution.DefaultBuildExecuter$1.proceed(DefaultBuildExecuter.java:43)
    at org.gradle.execution.DryRunBuildExecutionAction.execute(DryRunBuildExecutionAction.java:32)
    at org.gradle.execution.DefaultBuildExecuter.execute(DefaultBuildExecuter.java:37)
    at org.gradle.execution.DefaultBuildExecuter.execute(DefaultBuildExecuter.java:30)
    at org.gradle.initialization.DefaultGradleLauncher$3.execute(DefaultGradleLauncher.java:196)
    at org.gradle.initialization.DefaultGradleLauncher$3.execute(DefaultGradleLauncher.java:193)
    at org.gradle.internal.Transformers$4.transform(Transformers.java:169)
    at org.gradle.internal.progress.DefaultBuildOperationExecutor.run(DefaultBuildOperationExecutor.java:106)
    at org.gradle.internal.progress.DefaultBuildOperationExecutor.run(DefaultBuildOperationExecutor.java:56)
    at org.gradle.initialization.DefaultGradleLauncher.doBuildStages(DefaultGradleLauncher.java:193)
    at org.gradle.initialization.DefaultGradleLauncher.doBuild(DefaultGradleLauncher.java:119)
    at org.gradle.initialization.DefaultGradleLauncher.run(DefaultGradleLauncher.java:102)
    at org.gradle.launcher.exec.GradleBuildController.run(GradleBuildController.java:71)
    at org.gradle.tooling.internal.provider.runner.BuildModelActionRunner.run(BuildModelActionRunner.java:50)
    at org.gradle.launcher.exec.ChainingBuildActionRunner.run(ChainingBuildActionRunner.java:35)
    at org.gradle.tooling.internal.provider.runner.RunAsBuildOperationBuildActionRunner$1.execute(RunAsBuildOperationBuildActionRunner.java:43)
    at org.gradle.tooling.internal.provider.runner.RunAsBuildOperationBuildActionRunner$1.execute(RunAsBuildOperationBuildActionRunner.java:40)
    at org.gradle.internal.Transformers$4.transform(Transformers.java:169)
    at org.gradle.internal.progress.DefaultBuildOperationExecutor.run(DefaultBuildOperationExecutor.java:106)
    at org.gradle.internal.progress.DefaultBuildOperationExecutor.run(DefaultBuildOperationExecutor.java:56)
    at org.gradle.tooling.internal.provider.runner.RunAsBuildOperationBuildActionRunner.run(RunAsBuildOperationBuildActionRunner.java:40)
    at org.gradle.tooling.internal.provider.runner.SubscribableBuildActionRunner.run(SubscribableBuildActionRunner.java:75)
    at org.gradle.launcher.exec.ChainingBuildActionRunner.run(ChainingBuildActionRunner.java:35)
    at org.gradle.launcher.exec.InProcessBuildActionExecuter.execute(InProcessBuildActionExecuter.java:41)
    at org.gradle.launcher.exec.InProcessBuildActionExecuter.execute(InProcessBuildActionExecuter.java:26)
    at org.gradle.tooling.internal.provider.ContinuousBuildActionExecuter.execute(ContinuousBuildActionExecuter.java:75)
    at org.gradle.tooling.internal.provider.ContinuousBuildActionExecuter.execute(ContinuousBuildActionExecuter.java:49)
    at org.gradle.tooling.internal.provider.ServicesSetupBuildActionExecuter.execute(ServicesSetupBuildActionExecuter.java:44)
    at org.gradle.tooling.internal.provider.ServicesSetupBuildActionExecuter.execute(ServicesSetupBuildActionExecuter.java:29)
    at org.gradle.launcher.daemon.server.exec.ExecuteBuild.doBuild(ExecuteBuild.java:67)
    at org.gradle.launcher.daemon.server.exec.BuildCommandOnly.execute(BuildCommandOnly.java:36)
    at org.gradle.launcher.daemon.server.api.DaemonCommandExecution.proceed(DaemonCommandExecution.java:120)
    at org.gradle.launcher.daemon.server.exec.WatchForDisconnection.execute(WatchForDisconnection.java:47)
    at org.gradle.launcher.daemon.server.api.DaemonCommandExecution.proceed(DaemonCommandExecution.java:120)
    at org.gradle.launcher.daemon.server.exec.ResetDeprecationLogger.execute(ResetDeprecationLogger.java:26)
    at org.gradle.launcher.daemon.server.api.DaemonCommandExecution.proceed(DaemonCommandExecution.java:120)
    at org.gradle.launcher.daemon.server.exec.RequestStopIfSingleUsedDaemon.execute(RequestStopIfSingleUsedDaemon.java:34)
    at org.gradle.launcher.daemon.server.api.DaemonCommandExecution.proceed(DaemonCommandExecution.java:120)
    at org.gradle.launcher.daemon.server.exec.ForwardClientInput$2.call(ForwardClientInput.java:74)
    at org.gradle.launcher.daemon.server.exec.ForwardClientInput$2.call(ForwardClientInput.java:72)
    at org.gradle.util.Swapper.swap(Swapper.java:38)
    at org.gradle.launcher.daemon.server.exec.ForwardClientInput.execute(ForwardClientInput.java:72)
    at org.gradle.launcher.daemon.server.api.DaemonCommandExecution.proceed(DaemonCommandExecution.java:120)
    at org.gradle.launcher.daemon.server.exec.LogAndCheckHealth.execute(LogAndCheckHealth.java:55)
    at org.gradle.launcher.daemon.server.api.DaemonCommandExecution.proceed(DaemonCommandExecution.java:120)
    at org.gradle.launcher.daemon.server.exec.LogToClient.doBuild(LogToClient.java:60)
    at org.gradle.launcher.daemon.server.exec.BuildCommandOnly.execute(BuildCommandOnly.java:36)
    at org.gradle.launcher.daemon.server.api.DaemonCommandExecution.proceed(DaemonCommandExecution.java:120)
    at org.gradle.launcher.daemon.server.exec.EstablishBuildEnvironment.doBuild(EstablishBuildEnvironment.java:72)
    at org.gradle.launcher.daemon.server.exec.BuildCommandOnly.execute(BuildCommandOnly.java:36)
    at org.gradle.launcher.daemon.server.api.DaemonCommandExecution.proceed(DaemonCommandExecution.java:120)
    at org.gradle.launcher.daemon.server.exec.StartBuildOrRespondWithBusy$1.run(StartBuildOrRespondWithBusy.java:50)
    at org.gradle.launcher.daemon.server.DaemonStateCoordinator$1.run(DaemonStateCoordinator.java:297)
    at org.gradle.internal.concurrent.ExecutorPolicy$CatchAndRecordFailures.onExecute(ExecutorPolicy.java:54)
    at org.gradle.internal.concurrent.StoppableExecutorImpl$1.run(StoppableExecutorImpl.java:40)
Caused by: org.gradle.api.GradleException: Internal compiler error. See log for more details
    at org.jetbrains.kotlin.gradle.tasks.TasksUtilsKt.throwGradleExceptionIfError(tasksUtils.kt:9)
    at org.jetbrains.kotlin.gradle.internal.KaptTask.compile(KaptTask.kt:72)
    at org.gradle.internal.reflect.JavaMethod.invoke(JavaMethod.java:73)
    at org.gradle.api.internal.project.taskfactory.DefaultTaskClassInfoStore$StandardTaskAction.doExecute(DefaultTaskClassInfoStore.java:141)
    at org.gradle.api.internal.project.taskfactory.DefaultTaskClassInfoStore$StandardTaskAction.execute(DefaultTaskClassInfoStore.java:134)
    at org.gradle.api.internal.project.taskfactory.DefaultTaskClassInfoStore$StandardTaskAction.execute(DefaultTaskClassInfoStore.java:123)
    at org.gradle.api.internal.AbstractTask$TaskActionWrapper.execute(AbstractTask.java:632)
    at org.gradle.api.internal.AbstractTask$TaskActionWrapper.execute(AbstractTask.java:615)
    at org.gradle.api.internal.tasks.execution.ExecuteActionsTaskExecuter.executeAction(ExecuteActionsTaskExecuter.java:95)
    at org.gradle.api.internal.tasks.execution.ExecuteActionsTaskExecuter.executeActions(ExecuteActionsTaskExecuter.java:76)
    ... 78 more

Selon le Kotlin 1.0.4 libérer le changelog:

Vous devriez activer [generateStubs] seulement si vous rencontrez des problèmes avec le   défaut kapt implémentation du traitement des annotations.

Ce que j'ai essayé, mais pas de chance.


Racine build.gradle:

buildscript {
    repositories {
        jcenter()
    }
    dependencies {
        classpath "org.jetbrains.kotlin:kotlin-gradle-plugin:1.1.2"
        classpath "com.android.tools.build:gradle:2.3.1"
    }
}

allprojects {
    repositories {
        jcenter()
    }
}

task clean(type: Delete) {
    delete rootProject.buildDir
}

15
2018-04-27 14:44


origine


Réponses:


Bah, j'ai raté une partie du message d'erreur qui était avant la pause:

:app:kaptDebugKotlin
e: /Users/me/Downloads/App/app/build/tmp/kapt3/stubs/debug/com/example/app/ui/module/main/MainActivityModule.java:10: error: @dagger.android.ActivityKey methods should bind dagger.android.AndroidInjector.Factory<? extends android.app.Activity>, not dagger.android.AndroidInjector.Factory<? super android.app.Activity>. See google.github.io/dagger/android
e: 

e:     public abstract dagger.android.AndroidInjector.Factory<? super android.app.Activity> bindMainActivityInjectorFactory(@org.jetbrains.annotations.NotNull()
e:                                                                                          ^

w: warning: The following options were not recognized by any processor: '[kapt.kotlin.generated]'
w: 


e: /Users/me/Downloads/App/app/src/main/kotlin/com/example/app/ApplicationComponent.kt: (1, 1): Some error(s) occurred while processing annotations. Please see the error messages above.

J'utilisais le in annotation de la variance au lieu du out annotation lors de la création du AndroidInjector.Factory.

@Module(subcomponents = arrayOf(MainActivitySubcomponent::class))
abstract class MainActivityModule {

    @Binds @IntoMap @ActivityKey(MainActivity::class)
    abstract fun bindMainActivityInjectorFactory(
            builder: MainActivitySubcomponent.Builder): AndroidInjector.Factory<out Activity> // Was using `in` annotation instead of `out`
}

5
2018-04-27 19:22



Je pense que le problème est lié à la kotlin-stdlib-jre7, ça ne marche pas correctement avec dagger, je vous suggère de le changer kotlin-stdlib-jre7 pour kotlin-stdlib :

compile "org.jetbrains.kotlin:kotlin-stdlib:1.1.2"

au lieu de:

compile "org.jetbrains.kotlin:kotlin-stdlib-jre7:1.1.2"

ça marche pour moi.


4
2017-07-14 14:37



Il n'y a pas de raison unique pour cet échec de génération. Ce n'est pas toujours lié à kotlin ainsi que.

Vérifiez vos journaux dans Studio Android's Gradle Console  pour des informations claires sur la cause. Vous pouvez trouver la clé de l'échec.


4
2017-09-12 14:20



J'ai traversé le même problème. J'ai dû décoller de ma build.gradle:

  1. apply plugin: 'kotlin-kapt' 
  2. kapt 'groupId:artifactId:$kapt_version'

Et j'ai ajouté ceci (immédiatement après avoir appliqué la fiche: ....):

kapt {
    generateStubs = true
}

J'espère que cela pourrait aider quelqu'un d'autre.


1
2017-10-18 12:14